Reaction Details
TargetMuscarinic acetylcholine receptor M2
LigandBDBM35229
Substrate/Competitorn/a
Ki 50±n/a nM
CommentsPDSP_638
Citation Muth, EAHaskins, JTMoyer, JAHusbands, GENielsen, STSigg, EB Antidepressant biochemical profile of the novel bicyclic compound Wy-45,030, an ethyl cyclohexanol derivative. Biochem Pharmacol35:4493-7 (1986) 
 
Muscarinic acetylcholine receptor M2
Name:Muscarinic acetylcholine receptor M2
Type:Enzyme Catalytic Domain
Mol. Mass.:51555.53
Organism:RAT
Description:P10980
Residue:466
BDBM35229
NameBDBM35229
Synonyms:3-(10,11-dihydro-5H-dibenzo[b,f]azepin-5-yl)-N-methylpropan-1-amine CHEMBL72 DMI Desipramine N-(3-methylaminopropyl)iminobibenzyl demethylimipramine norimipramine
TypeSmall organic molecule
Emp. Form.C18H22N2
Mol. Mass.266.3807
SMILESCNCCCN1c2ccccc2CCc2ccccc12