Reaction Details
TargetBroad substrate specificity ATP-binding cassette transporter ABCG2
LigandBDBM106221
Substrate/Competitorn/a
Meas. Tech.Caco-2 cells assay
pH7.4±n/a
Temperature310.15±n/a K
IC50 3250±0.0 nM
Commentsextracted
Citation Li, YPrakash, SRXia, CQLiao, MM Inhibitor of breast cancer resistance protein (BCRP) US Patent US9695174 Publication Date 7/4/2017
 
Broad substrate specificity ATP-binding cassette transporter ABCG2
Name:Broad substrate specificity ATP-binding cassette transporter ABCG2
Type:Multi-pass membrane protein; monomer or homodimer; disulfide-linked
Mol. Mass.:72329.48
Organism:Homo sapiens (Human)
Description:Q9UNQ0
Residue:655
BDBM106221
NameBDBM106221
Synonyms:US9695174, Ko134
TypeSmall organic molecule
Emp. Form.C25H33N3O4
Mol. Mass.439.5472
SMILESCC(C)C[C@@H]1N2[C@@H](Cc3c1[nH]c1ccccc31)C(=O)N[C@@H](CCC(=O)OC(C)(C)C)C2=O