Reaction Details
TargetBroad substrate specificity ATP-binding cassette transporter ABCG2
LigandBDBM106158
Substrate/Competitorn/a
Meas. Tech.Caco-2 cells assay
pH7.4±n/a
Temperature310.15±n/a K
IC50>10000±0.0 nM
Commentsextracted
Citation Li, YPrakash, SRXia, CQLiao, MM Inhibitor of breast cancer resistance protein (BCRP) US Patent US9695174 Publication Date 7/4/2017
 
Broad substrate specificity ATP-binding cassette transporter ABCG2
Name:Broad substrate specificity ATP-binding cassette transporter ABCG2
Type:Multi-pass membrane protein; monomer or homodimer; disulfide-linked
Mol. Mass.:72329.48
Organism:Homo sapiens (Human)
Description:Q9UNQ0
Residue:655
BDBM106158
NameBDBM106158
Synonyms:US9695174, 8A
TypeSmall organic molecule
Emp. Form.C27H39N3O7
Mol. Mass.517.6145
SMILESCOC(=O)[C@H]1Cc2c([nH]c3cc(OC)c(OC)cc23)[C@H](CC(C)C)N1C(=O)[C@H](C)NC(=O)OC(C)(C)C