Reaction Details
TargetBroad substrate specificity ATP-binding cassette transporter ABCG2
LigandBDBM106207
Substrate/Competitorn/a
Meas. Tech.Caco-2 cells assay
pH7.4±n/a
Temperature310.15±n/a K
IC50 1980±0.0 nM
Commentsextracted
Citation Li, YPrakash, SRXia, CQLiao, MM Inhibitor of breast cancer resistance protein (BCRP) US Patent US9695174 Publication Date 7/4/2017
 
Broad substrate specificity ATP-binding cassette transporter ABCG2
Name:Broad substrate specificity ATP-binding cassette transporter ABCG2
Type:Multi-pass membrane protein; monomer or homodimer; disulfide-linked
Mol. Mass.:72329.48
Organism:Homo sapiens (Human)
Description:Q9UNQ0
Residue:655
BDBM106207
NameBDBM106207
Synonyms:US9695174, 12
TypeSmall organic molecule
Emp. Form.C21H27N3O3
Mol. Mass.369.4574
SMILESCOc1cc2[nH]c3[C@H](CC(C)C)N4[C@@H](Cc3c2cc1C)C(=O)N[C@@H](C)C4=O