Reaction Details
TargetATP-dependent translocase ABCB1
LigandBDBM106203
Substrate/Competitorn/a
Meas. Tech.Caco-2 cells assay
pH7.4±n/a
Temperature310.15±n/a K
IC50>30000±0.0 nM
Commentsextracted
Citation Li, YPrakash, SRXia, CQLiao, MM Inhibitor of breast cancer resistance protein (BCRP) US Patent US9695174 Publication Date 7/4/2017
 
ATP-dependent translocase ABCB1
Name:ATP-dependent translocase ABCB1
Type:Protein
Mol. Mass.:141503.50
Organism:Homo sapiens (Human)
Description:P08183
Residue:1280
BDBM106203
NameBDBM106203
Synonyms:US9695174, I-1
TypeSmall organic molecule
Emp. Form.C20H25N3O3
Mol. Mass.355.4308
SMILESCOc1ccc2c3C[C@@H]4N([C@@H](CC(C)C)c3[nH]c2c1)C(=O)[C@H](C)NC4=O