Reaction Details
TargetAlpha-2A adrenergic receptor
LigandBDBM50002338
Substrate/Competitorn/a
Ki 800±n/a nM
CommentsPDSP_1849
Citation Richelson, ENelson, A Antagonism by neuroleptics of neurotransmitter receptors of normal human brain in vitro. Eur J Pharmacol103:197-204 (1984) 
 
Alpha-2A adrenergic receptor
Name:Alpha-2A adrenergic receptor
Type:Enzyme
Mol. Mass.:48979.91
Organism:Homo sapiens (Human)
Description:P08913
Residue:465
BDBM50002338
NameBDBM50002338
Synonyms:(Thioridazine)10-[2-(1-Methyl-piperidin-2-yl)-ethyl]-2-methylsulfanyl-10H-phenothiazine 10-[2-(1-Methyl-piperidin-2-yl)-ethyl]-2-methylsulfanyl-10H-phenothiazine CHEMBL479 MELLARIL-S TP-21 | US9504692, Thioridazine
TypeSmall organic molecule
Emp. Form.C21H26N2S2
Mol. Mass.370.575
SMILESCSc1ccc2Sc3ccccc3N(CCC3CCCCN3C)c2c1