Reaction Details
TargetMuscarinic acetylcholine receptor M2
LigandBDBM81768
Substrate/Competitorn/a
Ki 0.04±n/a nM
CommentsPDSP_2042
Citation Richelson, ENelson, A Antagonism by neuroleptics of neurotransmitter receptors of normal human brain in vitro. Eur J Pharmacol103:197-204 (1984) 
 
Muscarinic acetylcholine receptor M2
Name:Muscarinic acetylcholine receptor M2
Type:GPCR
Mol. Mass.:51730.61
Organism:Homo sapiens (Human)
Description:P08172
Residue:466
BDBM81768
NameBDBM81768
Synonyms:BENZYLIC ACID NSC_5311391 | Quinuclidinyl benzilate
TypeSmall organic molecule
Emp. Form.C14H12O3
Mol. Mass.228.2433
SMILESOC(=O)C(O)(c1ccccc1)c1ccccc1