Reaction Details
TargetDihydrofolate reductase
LigandBDBM82109
Substrate/Competitorn/a
Meas. Tech.Inhibition Assay
IC50 2.3±0.0 nM
Citation Ma, XWoon, RSHo, PCChui, WK Antiproliferative activity against MCF-7 breast cancer cells by diamino-triazaspirodiene antifolates. Chem Biol Drug Des74:322-6 (2009) 
 
Dihydrofolate reductase
Name:Dihydrofolate reductase
Type:Enzyme
Mol. Mass.:21603.71
Organism:Bos taurus (Cattle)
Description:P00376
Residue:187
BDBM82109
NameBDBM82109
Synonyms:6,8,10-Traiazaspiro[4.5]deca-6,8-diene-7,9-diamine, Ie | CHEMBL1800937
TypeSmall organic molecule
Emp. Form.C16H23N5O2
Mol. Mass.317.3861
SMILESNC1=NC2(CCCC2)N(OCCCOc2ccccc2)C(N)=N1