Reaction Details
TargetCarbonic anhydrase 2
LigandBDBM50137675
Substrate/Competitorn/a
Meas. Tech.Enzyme Inhbition Assay
pH7.5±0
Temperature293.15±0 K
Ki 15±0.0 nM
Citation Winum, JYMontero, JLVullo, DSupuran, CT Carbonic anhydrase inhibitors: glycosylsulfanilamides act as subnanomolar inhibitors of the human secreted isoform VI. Chem Biol Drug Des74:636-9 (2009) 
 
Carbonic anhydrase 2
Name:Carbonic anhydrase 2
Type:Enzyme
Mol. Mass.:29250.71
Organism:Homo sapiens (Human)
Description:P00918
Residue:260
BDBM50137675
NameBDBM50137675
Synonyms:4-(3,4,5-Trihydroxy-tetrahydro-pyran-2-ylamino)-benzenesulfonamide N-(p-sulfamoylphenyl)-alpha-glycopyranosylamine, 4 N-(p-sulfamoylphenyl)-alpha-glycopyranosylamine, 6
TypeSmall organic molecule
Emp. Form.C11H16N2O6S
Mol. Mass.304.32
SMILESNS(=O)(=O)c1ccc(NC2OCC(O)C(O)C2O)cc1