Reaction Details
TargetEndoplasmic reticulum chaperone BiP
LigandBDBM32377
Substrate/Competitorn/a
Meas. Tech.SPR assay
pH7.4±0
Temperature298.15±0 K
Kd 7.7e+2±n/a nM
KOFF 0.3 s-1
Citation Macias, ATWilliamson, DSAllen, NBorgognoni, JClay, ADaniels, ZDokurno, PDrysdale, MJFrancis, GLGraham, CJHowes, RMatassova, NMurray, JBParsons, RShaw, TSurgenor, AETerry, LWang, YWood, MMassey, AJ Adenosine-derived inhibitors of 78 kDa glucose regulated protein (Grp78) ATPase: insights into isoform selectivity. J Med Chem54:4034-41 (2011) 
 
Endoplasmic reticulum chaperone BiP
Name:Endoplasmic reticulum chaperone BiP
Type:n/a
Mol. Mass.:72312.92
Organism:Homo sapiens (Human)
Description:P11021
Residue:654
BDBM32377
NameBDBM32377
Synonyms:adenosine-derived inhibitor (Grp78), 12 | adenosine-derived inhibitor, 11
TypeSmall organic molecule
Emp. Form.C24H24Cl2N6O4
Mol. Mass.531.391
SMILESNc1ncnc2n([C@@H]3O[C@H](COCc4ccccc4)[C@@H](O)[C@H]3O)c(NCc3ccc(Cl)c(Cl)c3)nc12