Reaction Details
TargetHeat shock 70 kDa protein 1A
LigandBDBM82124
Substrate/Competitorn/a
Meas. Tech.SPR assay
pH7.4±0
Temperature298.15±0 K
Kd 5e+2±n/a nM
Citation Macias, ATWilliamson, DSAllen, NBorgognoni, JClay, ADaniels, ZDokurno, PDrysdale, MJFrancis, GLGraham, CJHowes, RMatassova, NMurray, JBParsons, RShaw, TSurgenor, AETerry, LWang, YWood, MMassey, AJ Adenosine-derived inhibitors of 78 kDa glucose regulated protein (Grp78) ATPase: insights into isoform selectivity. J Med Chem54:4034-41 (2011) 
 
Heat shock 70 kDa protein 1A
Name:Heat shock 70 kDa protein 1A
Type:Chaperone
Mol. Mass.:70043.82
Organism:Homo sapiens (Human)
Description:n/a
Residue:641
BDBM82124
NameBDBM82124
Synonyms:adenosine-derived inhibitor (Grp78), 1
TypeSmall organic molecule
Emp. Form.C10H14N5O10P2
Mol. Mass.426.1937
SMILESNc1ncnc2n(cnc12)[C@@H]1O[C@H](COP(O)(=O)OP(O)([O-])=O)[C@@H](O)[C@H]1O