Reaction Details
TargetAlpha-1,6-mannosyl-glycoprotein 2-beta-N-acetylglucosaminyltransferase
LigandBDBM272059
Substrate/Competitorn/a
Meas. Tech.MGAT2 Human Assay
Temperature298.15±n/a K
IC50 7.10±n/a nM
Commentsextracted
Citation Berger, RBlizzard, TACampbell, BTChen, HYDebenham, JSDewnani, SVDubois, BGude, CGuo, ZZHarper, BHu, ZLin, SLiu, PWang, MUjjainwalla, FXu, JXu, LZhang, R Isoquinoline derivatives as MGAT2 inhibitors US Patent US10065945 Publication Date 9/4/2018
 
Alpha-1,6-mannosyl-glycoprotein 2-beta-N-acetylglucosaminyltransferase
Name:Alpha-1,6-mannosyl-glycoprotein 2-beta-N-acetylglucosaminyltransferase
Type:n/a
Mol. Mass.:51567.80
Organism:Homo sapiens (Human)
Description:Q10469
Residue:447
BDBM272059
NameBDBM272059
Synonyms:US10065945, Example 53
TypeSmall organic molecule
Emp. Form.C22H23F2N5O4S
Mol. Mass.491.511
SMILESCCNC(=O)c1noc(NS(=O)(=O)c2ccc3CCN(Cc3c2)[C@H](C)c2cc(F)cc(F)c2)n1