Reaction Details
TargetAlpha-1,6-mannosyl-glycoprotein 2-beta-N-acetylglucosaminyltransferase
LigandBDBM272061
Substrate/Competitorn/a
Meas. Tech.MGAT2 Human Assay
Temperature298.15±n/a K
IC50 3.70±n/a nM
Commentsextracted
Citation Berger, RBlizzard, TACampbell, BTChen, HYDebenham, JSDewnani, SVDubois, BGude, CGuo, ZZHarper, BHu, ZLin, SLiu, PWang, MUjjainwalla, FXu, JXu, LZhang, R Isoquinoline derivatives as MGAT2 inhibitors US Patent US10065945 Publication Date 9/4/2018
 
Alpha-1,6-mannosyl-glycoprotein 2-beta-N-acetylglucosaminyltransferase
Name:Alpha-1,6-mannosyl-glycoprotein 2-beta-N-acetylglucosaminyltransferase
Type:n/a
Mol. Mass.:51567.80
Organism:Homo sapiens (Human)
Description:Q10469
Residue:447
BDBM272061
NameBDBM272061
Synonyms:US10065945, Example 55
TypeSmall organic molecule
Emp. Form.C23H23F2N5O4S
Mol. Mass.503.522
SMILESC[C@@H](N1CCc2ccc(cc2C1)S(=O)(=O)Nc1nc(no1)C(=O)N1CCC1)c1cc(F)cc(F)c1