Reaction Details
TargetSerum paraoxonase/arylesterase 1
LigandBDBM50316126
Substrate/Competitorn/a
Meas. Tech.In Vitro Inhibtion Assay
Ki 86000±0.0 nM
IC50 180000±0.0 nM
Citation Ekinci, DSentürk, MBeydemir, SKüfrevioglu, OISupuran, CT An alternative purification method for human serum paraoxonase 1 and its interactions with sulfonamides. Chem Biol Drug Des76:552-8 (2010) 
 
Serum paraoxonase/arylesterase 1
Name:Serum paraoxonase/arylesterase 1
Type:Enzyme
Mol. Mass.:39719.73
Organism:Homo sapiens (Human)
Description:P27169
Residue:355
BDBM50316126
NameBDBM50316126
Synonyms:Bleph-10 Blephamide Cetamide FML-S Metimyd Ocusulf-10 Predamide SULF-10 SULFACETAMIDE Sulfacetamide, 1 Sulphacetamide Sulster Vasocidin
TypeSmall organic molecule
Emp. Form.C8H10N2O3S
Mol. Mass.214.242
SMILESCC(=O)NS(=O)(=O)c1ccc(N)cc1