Reaction Details
Target5-hydroxytryptamine receptor 2A
LigandBDBM21395
Substrate/Competitorn/a
Ki 1.04±n/a nM
CommentsPDSP_1014
Citation Battaglia, GShannon, MBorgundvaag, BTiteler, M pH-dependent modulation of agonist interactions with [3H]-ketanserin-labelled S2 serotonin receptors. Life Sci33:2011-6 (1983) 
 
5-hydroxytryptamine receptor 2A
Name:5-hydroxytryptamine receptor 2A
Type:G Protein-Coupled Receptor (GPCR)
Mol. Mass.:52852.05
Organism:Rattus norvegicus (rat)
Description:Rat cortex membranes 5-HT2A receptors.
Residue:471
BDBM21395
NameBDBM21395
Synonyms:3-(2-(4-(4-Fluorobenzoyl)piperidinol)ethyl)-2,4(1H,3H)-quinazolinedione CHEMBL1628637 Ketanserin R-41-468 [3H]-Ketanserin
Typeradiolabeled ligand
Emp. Form.C22H22FN3O3
Mol. Mass.395.4268
SMILESFc1ccc(cc1)C(=O)C1CCN(CCn2c(=O)[nH]c3ccccc3c2=O)CC1