Reaction Details
Target5-hydroxytryptamine receptor 2A
LigandBDBM50014407
Substrate/Competitorn/a
Ki 226±n/a nM
CommentsPDSP_1578
Citation Battaglia, GShannon, MBorgundvaag, BTiteler, M pH-dependent modulation of agonist interactions with [3H]-ketanserin-labelled S2 serotonin receptors. Life Sci33:2011-6 (1983) 
 
5-hydroxytryptamine receptor 2A
Name:5-hydroxytryptamine receptor 2A
Type:G Protein-Coupled Receptor (GPCR)
Mol. Mass.:52852.05
Organism:Rattus norvegicus (rat)
Description:Rat cortex membranes 5-HT2A receptors.
Residue:471
BDBM50014407
NameBDBM50014407
Synonyms:2-(piperazin-1-yl)quinoline 2-Piperazin-1-yl-quinoline (Quipazine) CHEMBL18772 | QUIPAZINE
TypeSmall organic molecule
Emp. Form.C13H15N3
Mol. Mass.213.2783
SMILESC1CN(CCN1)c1ccc2ccccc2n1