Reaction Details
TargetHrh3 protein
LigandBDBM22914
Substrate/Competitorn/a
Ki 1.8±n/a nM
CommentsPDSP_1847
Citation Tedford, CEYates, SLPawlowski, GPNalwalk, JWHough, LBKhan, MAPhillips, JGDurant, GJFrederickson, RC Pharmacological characterization of GT-2016, a non-thiourea-containing histamine H3 receptor antagonist: in vitro and in vivo studies. J Pharmacol Exp Ther275:598-604 (1995) Hrh3 protein
Name:Hrh3 protein
Type:Enzyme Catalytic Domain
Mol. Mass.:37860.96
Organism:RAT
Description:Q5PPG3
Residue:344
BDBM22914
NameBDBM22914
Synonyms:CHEMBL260374 Thioperamide | US11622967, Compound Thioperamide
TypeSmall organic molecule
Emp. Form.C15H24N4S
Mol. Mass.292.443
SMILESS=C(NC1CCCCC1)N1CCC(CC1)c1cnc[nH]1