Reaction Details
Target5-hydroxytryptamine receptor 6
LigandBDBM82087
Substrate/Competitorn/a
Ki 38.9±n/a nM
CommentsPDSP_172
Citation Monsma, FJShen, YWard, RPHamblin, MWSibley, DR Cloning and expression of a novel serotonin receptor with high affinity for tricyclic psychotropic drugs. Mol Pharmacol43:320-7 (1993) 5-hydroxytryptamine receptor 6
Name:5-hydroxytryptamine receptor 6
Type:Enzyme Catalytic Domain
Mol. Mass.:46945.51
Organism:RAT
Description:5-HT6 HTR6 RAT::P31388
Residue:436
BDBM82087
NameBDBM82087
Synonyms:2-(5-methoxy-1H-indol-3-yl)ethanamine 5-Methoxytryptamine hydrochloride tryptamine, 5-Methoxy
TypeSmall organic molecule
Emp. Form.C11H14N2O
Mol. Mass.190.2417
SMILESCOc1ccc2[nH]cc(CCN)c2c1