Reaction Details
Target5-hydroxytryptamine receptor 6
LigandBDBM50028672
Substrate/Competitorn/a
Ki 36.5±n/a nM
CommentsPDSP_1063
Citation Monsma, FJShen, YWard, RPHamblin, MWSibley, DR Cloning and expression of a novel serotonin receptor with high affinity for tricyclic psychotropic drugs. Mol Pharmacol43:320-7 (1993) 5-hydroxytryptamine receptor 6
Name:5-hydroxytryptamine receptor 6
Type:Enzyme Catalytic Domain
Mol. Mass.:46945.51
Organism:RAT
Description:5-HT6 HTR6 RAT::P31388
Residue:436
BDBM50028672
NameBDBM50028672
Synonyms:(5-Chloro-7-methyl-4,6,6a,7,8,9,10,10a-octahydro-indolo[4,3-fg]quinolin-9-yl)-acetonitrile LERGOTRILE
TypeSmall organic molecule
Emp. Form.C17H18ClN3
Mol. Mass.299.798
SMILESCN1CC(CC#N)CC2C1Cc1c(Cl)[nH]c3cccc2c13