Reaction Details
Target5-hydroxytryptamine receptor 6
LigandBDBM22867
Substrate/Competitorn/a
Ki 5.3±n/a nM
CommentsPDSP_1079
Citation Monsma, FJShen, YWard, RPHamblin, MWSibley, DR Cloning and expression of a novel serotonin receptor with high affinity for tricyclic psychotropic drugs. Mol Pharmacol43:320-7 (1993) 5-hydroxytryptamine receptor 6
Name:5-hydroxytryptamine receptor 6
Type:Enzyme Catalytic Domain
Mol. Mass.:46945.51
Organism:RAT
Description:5-HT6 HTR6 RAT::P31388
Residue:436
BDBM22867
NameBDBM22867
Synonyms:1,1-diethyl-3-[(8beta)-6-methyl-9,10-didehydroergolin-8-yl]urea 8R-lisuride | LISURIDE
TypeSmall organic molecule
Emp. Form.C20H26N4O
Mol. Mass.338.4466
SMILES[H][C@@]12Cc3c[nH]c4cccc(C1=C[C@H](CN2C)NC(=O)N(CC)CC)c34