Reaction Details
Target5-hydroxytryptamine receptor 6
LigandBDBM78940
Substrate/Competitorn/a
Ki 1.84±n/a nM
CommentsPDSP_1219
Citation Monsma, FJShen, YWard, RPHamblin, MWSibley, DR Cloning and expression of a novel serotonin receptor with high affinity for tricyclic psychotropic drugs. Mol Pharmacol43:320-7 (1993) 5-hydroxytryptamine receptor 6
Name:5-hydroxytryptamine receptor 6
Type:Enzyme Catalytic Domain
Mol. Mass.:46945.51
Organism:RAT
Description:5-HT6 HTR6 RAT::P31388
Residue:436
BDBM78940
NameBDBM78940
Synonyms:METHIOTHEPIN Methiothepin mesylate salt cid_3039995 methanesulfonic acid;1-methyl-4-(3-methylsulfanyl-5,6-dihydrobenzo[b][1]benzothiepin-5-yl)piperazine | methanesulfonic acid;1-methyl-4-[3-(methylthio)-5,6-dihydrobenzo[b][1]benzothiepin-5-yl]piperazine
TypeSmall organic molecule
Emp. Form.C20H24N2S2
Mol. Mass.356.548
SMILESCSc1ccc2Sc3ccccc3CC(N3CCN(C)CC3)c2c1