Reaction Details
Target5-hydroxytryptamine receptor 5A
LigandBDBM50010301
Substrate/Competitorn/a
Ki 1000±n/a nM
CommentsPDSP_1725
Citation Erlander, MGLovenberg, TWBaron, BMde Lecea, LDanielson, PERacke, MSlone, ALSiegel, BWFoye, PECannon, K Two members of a distinct subfamily of 5-hydroxytryptamine receptors differentially expressed in rat brain. Proc Natl Acad Sci U S A90:3452-6 (1993) 
 
5-hydroxytryptamine receptor 5A
Name:5-hydroxytryptamine receptor 5A
Type:Enzyme Catalytic Domain
Mol. Mass.:40684.21
Organism:RAT
Description:5-HT5a HTR5A RAT::P35364
Residue:357
BDBM50010301
NameBDBM50010301
Synonyms:8-Bromo-3-methyl-5-phenyl-2,3,4,5-tetrahydro-1H-benzo[d]azepin-7-ol(SKF 83566) SKF 83566
TypeSmall organic molecule
Emp. Form.C17H18BrNO
Mol. Mass.332.235
SMILESCN1CCc2cc(Br)c(O)cc2C(C1)c1ccccc1