Reaction Details
TargetGlutamate metabotropic receptor 1
LigandBDBM50004863
Substrate/Competitorn/a
Ki>10000±n/a nM
CommentsPDSP_3720
Citation Joly, CGomeza, JBrabet, ICurry, KBockaert, JPin, JP Molecular, functional, and pharmacological characterization of the metabotropic glutamate receptor type 5 splice variants: comparison with mGluR1. J Neurosci15:3970-81 (1995) Glutamate metabotropic receptor 1
Name:Glutamate metabotropic receptor 1
Synonyms:Metabotropic Glutamate 1a
Type:Enzyme Catalytic Domain
Mol. Mass.:101383.99
Organism:PORCINE
Description:F1S737
Residue:906
BDBM50004863
NameBDBM50004863
TypeSmall organic molecule
Emp. Form.C7H11NO4
Mol. Mass.173.1665
SMILESN[C@]1(CC[C@@H](C1)C(O)=O)C(O)=O