Reaction Details
TargetGlutamate metabotropic receptor 5
LigandBDBM50004863
Substrate/Competitorn/a
Ki 5300±n/a nM
CommentsPDSP_96
Citation Joly, CGomeza, JBrabet, ICurry, KBockaert, JPin, JP Molecular, functional, and pharmacological characterization of the metabotropic glutamate receptor type 5 splice variants: comparison with mGluR1. J Neurosci15:3970-81 (1995) Glutamate metabotropic receptor 5
Name:Glutamate metabotropic receptor 5
Type:Enzyme Catalytic Domain
Mol. Mass.:120646.45
Organism:PORCINE
Description:metabotropic glutamate 5a 0 PORCINE::H0VDS0
Residue:1094
BDBM50004863
NameBDBM50004863
Synonyms:(+/-)-trans-ACPD (1S,3S)-1-aminocyclopentane-1,3-dicarboxylic acid 1-Amino-cyclopentane-1,3-dicarboxylic acid(cis-(1S,3S)-ACPD) 1R,3S-ACPD CHEMBL29726
TypeSmall organic molecule
Emp. Form.C7H11NO4
Mol. Mass.173.1665
SMILESN[C@]1(CC[C@@H](C1)C(O)=O)C(O)=O