Reaction Details
Target5-hydroxytryptamine receptor 2C
LigandBDBM82438
Substrate/Competitorn/a
Ki 36±n/a nM
CommentsPDSP_805
Citation Cusack, BNelson, ARichelson, E Binding of antidepressants to human brain receptors: focus on newer generation compounds. Psychopharmacology (Berl)114:559-65 (1994) 
 
5-hydroxytryptamine receptor 2C
Name:5-hydroxytryptamine receptor 2C
Type:G Protein-Coupled Receptor (GPCR)
Mol. Mass.:51836.79
Organism:Homo sapiens (Human)
Description:P28335
Residue:458
BDBM82438
NameBDBM82438
Synonyms:CAS_52942-31-1 NSC_40589
TypeSmall organic molecule
Emp. Form.C19H28ClN5O
Mol. Mass.377.912
SMILESCCc1nn(CCCN2CCN(CC2)c2cccc(Cl)c2)c(=O)n1CC