Reaction Details
Target5-hydroxytryptamine receptor 2C
LigandBDBM50073444
Substrate/Competitorn/a
Ki 25±n/a nM
CommentsPDSP_1905
Citation Cusack, BNelson, ARichelson, E Binding of antidepressants to human brain receptors: focus on newer generation compounds. Psychopharmacology (Berl)114:559-65 (1994) 
 
5-hydroxytryptamine receptor 2C
Name:5-hydroxytryptamine receptor 2C
Type:G Protein-Coupled Receptor (GPCR)
Mol. Mass.:51836.79
Organism:Homo sapiens (Human)
Description:P28335
Residue:458
BDBM50073444
NameBDBM50073444
Synonyms:2-{3-[4-(3-chlorophenyl)piperazin-1-yl]propyl}[1,2,4]triazolo[4,3-a]pyridin-3(2H)-one TRAZODONE
TypeSmall organic molecule
Emp. Form.C19H22ClN5O
Mol. Mass.371.864
SMILESClc1cccc(c1)N1CCN(CCCn2nc3ccccn3c2=O)CC1