Reaction Details
TargetAlpha-1A adrenergic receptor
LigandBDBM82438
Substrate/Competitorn/a
Ki 38±n/a nM
CommentsPDSP_805
Citation Cusack, BNelson, ARichelson, E Binding of antidepressants to human brain receptors: focus on newer generation compounds. Psychopharmacology (Berl)114:559-65 (1994) 
 
Alpha-1A adrenergic receptor
Name:Alpha-1A adrenergic receptor
Type:Cell-surface receptors
Mol. Mass.:51511.67
Organism:Homo sapiens (Human)
Description:P35348
Residue:466
BDBM82438
NameBDBM82438
Synonyms:CAS_52942-31-1 NSC_40589
TypeSmall organic molecule
Emp. Form.C19H28ClN5O
Mol. Mass.377.912
SMILESCCc1nn(CCCN2CCN(CC2)c2cccc(Cl)c2)c(=O)n1CC