Reaction Details
TargetAlpha-1A adrenergic receptor
LigandBDBM82437
Substrate/Competitorn/a
Ki 100±n/a nM
CommentsPDSP_1088
Citation Cusack, BNelson, ARichelson, E Binding of antidepressants to human brain receptors: focus on newer generation compounds. Psychopharmacology (Berl)114:559-65 (1994) 
 
Alpha-1A adrenergic receptor
Name:Alpha-1A adrenergic receptor
Type:Cell-surface receptors
Mol. Mass.:51511.67
Organism:Homo sapiens (Human)
Description:P35348
Residue:466
BDBM82437
NameBDBM82437
Synonyms:CAS_23047-25-8 NSC_3947 | US8629135, SW-06
TypeSmall organic molecule
Emp. Form.C26H27ClN2O
Mol. Mass.418.958
SMILESCN(CCCN1c2ccccc2CCc2ccccc12)CC(=O)c1ccc(Cl)cc1