Reaction Details
TargetAlpha-2A adrenergic receptor
LigandBDBM50073444
Substrate/Competitorn/a
Ki 320±n/a nM
CommentsPDSP_1905
Citation Cusack, BNelson, ARichelson, E Binding of antidepressants to human brain receptors: focus on newer generation compounds. Psychopharmacology (Berl)114:559-65 (1994) 
 
Alpha-2A adrenergic receptor
Name:Alpha-2A adrenergic receptor
Type:Enzyme
Mol. Mass.:48979.91
Organism:Homo sapiens (Human)
Description:P08913
Residue:465
BDBM50073444
NameBDBM50073444
Synonyms:2-{3-[4-(3-chlorophenyl)piperazin-1-yl]propyl}[1,2,4]triazolo[4,3-a]pyridin-3(2H)-one TRAZODONE
TypeSmall organic molecule
Emp. Form.C19H22ClN5O
Mol. Mass.371.864
SMILESClc1cccc(c1)N1CCN(CCCn2nc3ccccn3c2=O)CC1