Reaction Details
TargetMuscarinic acetylcholine receptor M2
LigandBDBM50014247
Substrate/Competitorn/a
Ki 184±n/a nM
CommentsPDSP_811
Citation Cusack, BNelson, ARichelson, E Binding of antidepressants to human brain receptors: focus on newer generation compounds. Psychopharmacology (Berl)114:559-65 (1994) 
 
Muscarinic acetylcholine receptor M2
Name:Muscarinic acetylcholine receptor M2
Type:GPCR
Mol. Mass.:51730.61
Organism:Homo sapiens (Human)
Description:P08172
Residue:466
BDBM50014247
NameBDBM50014247
Synonyms:(3R,4S)-3-(4-Methoxy-phenoxymethyl)-1-methyl-4-phenyl-piperidine CHEMBL94739 | Femoxetine
TypeSmall organic molecule
Emp. Form.C20H25NO2
Mol. Mass.311.418
SMILESCOc1ccc(OC[C@H]2CN(C)CC[C@@H]2c2ccccc2)cc1