Reaction Details
TargetMuscarinic acetylcholine receptor M2
LigandBDBM82437
Substrate/Competitorn/a
Ki 67±n/a nM
CommentsPDSP_1088
Citation Cusack, BNelson, ARichelson, E Binding of antidepressants to human brain receptors: focus on newer generation compounds. Psychopharmacology (Berl)114:559-65 (1994) 
 
Muscarinic acetylcholine receptor M2
Name:Muscarinic acetylcholine receptor M2
Type:GPCR
Mol. Mass.:51730.61
Organism:Homo sapiens (Human)
Description:P08172
Residue:466
BDBM82437
NameBDBM82437
Synonyms:CAS_23047-25-8 NSC_3947 | US8629135, SW-06
TypeSmall organic molecule
Emp. Form.C26H27ClN2O
Mol. Mass.418.958
SMILESCN(CCCN1c2ccccc2CCc2ccccc12)CC(=O)c1ccc(Cl)cc1