Reaction Details
TargetHistamine H1 receptor
LigandBDBM82437
Substrate/Competitorn/a
Ki 360±n/a nM
CommentsPDSP_1088
Citation Cusack, BNelson, ARichelson, E Binding of antidepressants to human brain receptors: focus on newer generation compounds. Psychopharmacology (Berl)114:559-65 (1994) 
 
Histamine H1 receptor
Name:Histamine H1 receptor
Type:G Protein-Coupled Receptor (GPCR)
Mol. Mass.:55808.72
Organism:Homo sapiens (Human)
Description:Cell pellets from SK-N-MC cells transfected with human H1 receptor were used in binding assay.
Residue:487
BDBM82437
NameBDBM82437
Synonyms:CAS_23047-25-8 NSC_3947 | US8629135, SW-06
TypeSmall organic molecule
Emp. Form.C26H27ClN2O
Mol. Mass.418.958
SMILESCN(CCCN1c2ccccc2CCc2ccccc12)CC(=O)c1ccc(Cl)cc1