Reaction Details
Target5-hydroxytryptamine receptor 2C
LigandBDBM82505
Substrate/Competitorn/a
Ki 125.89±n/a nM
CommentsPDSP_1672
Citation Wardle, KAEllis, ESBaxter, GSKennett, GAGaster, LMSanger, GJ The effects of SB 204070, a highly potent and selective 5-HT4 receptor antagonist, on guinea-pig distal colon. Br J Pharmacol112:789-94 (1994) 
 
5-hydroxytryptamine receptor 2C
Name:5-hydroxytryptamine receptor 2C
Type:Enzyme Catalytic Domain
Mol. Mass.:51519.58
Organism:PIG
Description:G7ZKZ7
Residue:457
BDBM82505
NameBDBM82505
Synonyms:CAS_121881 SB204070
TypeSmall organic molecule
Emp. Form.C19H27ClN2O4
Mol. Mass.382.882
SMILESCCCCN1CCC(COC(=O)c2cc(Cl)c(N)c3OCCOc23)CC1