Reaction Details
TargetPhosphatidylinositol 4,5-bisphosphate 3-kinase catalytic subunit alpha isoform
LigandBDBM272882
Substrate/Competitorn/a
Meas. Tech.p110alpha (alpha) PI3K Binding Assay
Ki 0.056±n/a nM
Citation Braun, MGarland, KHanan, EPurkey, HStaben, STHeald, RAKnight, JMacleod, CLu, AWu, GYeap, SK Tricyclic PI3K inhibitor compounds and methods of use US Patent US10065970 Publication Date 9/4/2018
 
Phosphatidylinositol 4,5-bisphosphate 3-kinase catalytic subunit alpha isoform
Name:Phosphatidylinositol 4,5-bisphosphate 3-kinase catalytic subunit alpha isoform
Type:Enzyme Subunit
Mol. Mass.:124294.87
Organism:Homo sapiens (Human)
Description:P42336
Residue:1068
BDBM272882
NameBDBM272882
Synonyms:(S)-2-((1-(2- aminoquinoxalin-6- yl)-8,9-dihydro-7H- 6-oxa-2,9a- diazabenzo[cd]azulen- 4-yl)amino)-2- cyclopropylacetamide US10435414, Compound 187
TypeSmall organic molecule
Emp. Form.C23H23N7O2
Mol. Mass.429.4744
SMILESNC(=O)[C@@H](Nc1cc2OCCCn3c(nc(c1)c23)-c1ccc2nc(N)cnc2c1)C1CC1