Reaction Details
TargetPhosphatidylinositol 4,5-bisphosphate 3-kinase catalytic subunit alpha isoform
LigandBDBM272889
Substrate/Competitorn/a
Meas. Tech.p110alpha (alpha) PI3K Binding Assay
Ki 0.026±n/a nM
Citation Braun, MGarland, KHanan, EPurkey, HStaben, STHeald, RAKnight, JMacleod, CLu, AWu, GYeap, SK Tricyclic PI3K inhibitor compounds and methods of use US Patent US10065970 Publication Date 9/4/2018
 
Phosphatidylinositol 4,5-bisphosphate 3-kinase catalytic subunit alpha isoform
Name:Phosphatidylinositol 4,5-bisphosphate 3-kinase catalytic subunit alpha isoform
Type:Enzyme Subunit
Mol. Mass.:124294.87
Organism:Homo sapiens (Human)
Description:P42336
Residue:1068
BDBM272889
NameBDBM272889
Synonyms:(S)-1-(1-(2- aminobenzo[d]oxazol- 5-yl)-3-fluoro-8,9- dihydro-7H-6-oxa- 2,9a- diazabenzo[cd]azulen- 4-yl)pyrrolidine-2- carboxamide US10435414, Compound 194
TypeSmall organic molecule
Emp. Form.C22H21FN6O3
Mol. Mass.436.4389
SMILESNC(=O)[C@@H]1CCCN1c1cc2OCCCn3c(nc(c1F)c23)-c1ccc2oc(N)nc2c1