Reaction Details
TargetPhosphatidylinositol 4,5-bisphosphate 3-kinase catalytic subunit alpha isoform
LigandBDBM272899
Substrate/Competitorn/a
Meas. Tech.p110alpha (alpha) PI3K Binding Assay
Ki<0.020±n/a nM
Citation Braun, MGarland, KHanan, EPurkey, HStaben, STHeald, RAKnight, JMacleod, CLu, AWu, GYeap, SK Tricyclic PI3K inhibitor compounds and methods of use US Patent US10065970 Publication Date 9/4/2018
 
Phosphatidylinositol 4,5-bisphosphate 3-kinase catalytic subunit alpha isoform
Name:Phosphatidylinositol 4,5-bisphosphate 3-kinase catalytic subunit alpha isoform
Type:Enzyme Subunit
Mol. Mass.:124294.87
Organism:Homo sapiens (Human)
Description:P42336
Residue:1068
BDBM272899
NameBDBM272899
Synonyms:(S)-2-((1-(2- aminobenzo[d]oxazol- 5-yl)-7,8,9,10- tetrahydro-6-oxa- 2,10a- diazacycloocta[cd]- inden-4- yl)oxy)propanamide | US10065970, Compound 204
TypeSmall organic molecule
Emp. Form.C22H25N5O4
Mol. Mass.423.465
SMILESC\C=C(\O[C@@H](C)C(N)=O)/C=c1/nc(-c2ccc3oc(N)nc3c2)n2CCCCO/C=c/1\2