Reaction Details
TargetPhosphatidylinositol 4,5-bisphosphate 3-kinase catalytic subunit alpha isoform
LigandBDBM272945
Substrate/Competitorn/a
Meas. Tech.p110alpha (alpha) PI3K Binding Assay
Ki<0.020±n/a nM
Citation Braun, MGarland, KHanan, EPurkey, HStaben, STHeald, RAKnight, JMacleod, CLu, AWu, GYeap, SK Tricyclic PI3K inhibitor compounds and methods of use US Patent US10065970 Publication Date 9/4/2018
 
Phosphatidylinositol 4,5-bisphosphate 3-kinase catalytic subunit alpha isoform
Name:Phosphatidylinositol 4,5-bisphosphate 3-kinase catalytic subunit alpha isoform
Type:Enzyme Subunit
Mol. Mass.:124294.87
Organism:Homo sapiens (Human)
Description:P42336
Residue:1068
BDBM272945
NameBDBM272945
Synonyms:(S)-1-(1-(2- aminobenzo[d]oxazol- 5-yl)-7,8,9,10- tetrahydro-6-oxa-2,10a- diazacycloocta[cd]inden- 4-yl)pyrrolidine-2- carboxamide US10435414, Example 250
TypeSmall organic molecule
Emp. Form.C23H24N6O3
Mol. Mass.432.4751
SMILESNC(=O)[C@@H]1CCCN1c1cc2OCCCCn3c(nc(c1)c23)-c1ccc2oc(N)nc2c1