Reaction Details
TargetMu-type opioid receptor
LigandBDBM21865
Substrate/Competitorn/a
Ki 0.26±n/a nM
CommentsPDSP_676
Citation Standifer, KMCheng, JBrooks, AIHonrado, CPSu, WVisconti, LMBiedler, JLPasternak, GW Biochemical and pharmacological characterization of mu, delta and kappa 3 opioid receptors expressed in BE(2)-C neuroblastoma cells. J Pharmacol Exp Ther270:1246-55 (1994) Mu-type opioid receptor
Name:Mu-type opioid receptor
Type:G Protein-Coupled Receptor (GPCR)
Mol. Mass.:44789.51
Organism:Homo sapiens (Human)
Description:P35372
Residue:400
BDBM21865
NameBDBM21865
Synonyms:(14beta)-17-(cyclopropylmethyl)-18-(1-hydroxy-1-methylethyl)-6-methoxy-18,19-dihydro-4,5-epoxy-6,14-ethenomorphinan-3-ol CHEMBL24995 [3H]-diprenorphine
Typeradiolabeled ligand
Emp. Form.C26H35NO4
Mol. Mass.425.5604
SMILES[H][C@]12Cc3ccc(O)c4OC5[C@](CCN1CC1CC1)(c34)[C@@]21CCC5(OC)C(C1)C(C)(C)O