Reaction Details
TargetHrh3 protein
LigandBDBM22911
Substrate/Competitorn/a
Ki 0.15±n/a nM
CommentsPDSP_968
Citation Ligneau, XGarbarg, MVizuete, MLDiaz, JPurand, KStark, HSchunack, WSchwartz, JC [125I]iodoproxyfan, a new antagonist to label and visualize cerebral histamine H3 receptors. J Pharmacol Exp Ther271:452-9 (1994) Hrh3 protein
Name:Hrh3 protein
Type:Enzyme Catalytic Domain
Mol. Mass.:37860.96
Organism:RAT
Description:Q5PPG3
Residue:344
BDBM22911
NameBDBM22911
Synonyms:2-(3H-imidazol-4-yl)ethylsulfanylmethanimidamide CHEMBL544911 {[2-(1H-imidazol-4-yl)ethyl]sulfanyl}methanimidamide
TypeSmall organic molecule
Emp. Form.C6H10N4S
Mol. Mass.170.235
SMILESNC(=N)SCCc1cnc[nH]1