Reaction Details
TargetKynurenine/alpha-aminoadipate aminotransferase, mitochondrial
LigandBDBM273025
Substrate/Competitorn/a
Meas. Tech.KAT-II inhibitory assay
pH8±n/a
IC50 14.0±n/a nM
Commentsextracted
Citation Okuyama, MFukunaga, KUsui, KHayashi, NIijima, DHoriuchi, HItagaki, N Bicyclic or tricyclic heterocyclic compound US Patent US10065972 Publication Date 9/4/2018
 
Kynurenine/alpha-aminoadipate aminotransferase, mitochondrial
Name:Kynurenine/alpha-aminoadipate aminotransferase, mitochondrial
Type:Enzyme
Mol. Mass.:47353.09
Organism:Homo sapiens (Human)
Description:Q8N5Z0
Residue:425
BDBM273025
NameBDBM273025
Synonyms:(R)-2-[5-(2,4-difluorophenyl)-7-oxo-6,7-dihydro[1,3]thiazolo[5,4-d]pyrimidin-2-yl]pyrrolidine-1-carboxylic acid phenyl ester | US10065972, Example 67
TypeSmall organic molecule
Emp. Form.C22H16F2N4O3S
Mol. Mass.454.449
SMILESFc1ccc(c(F)c1)-c1nc2sc(nc2c(=O)[nH]1)[C@H]1CCCN1C(=O)Oc1ccccc1