Reaction Details
TargetKynurenine/alpha-aminoadipate aminotransferase, mitochondrial
LigandBDBM273078
Substrate/Competitorn/a
Meas. Tech.KAT-II inhibitory assay
pH8±n/a
IC50 16.0±n/a nM
Commentsextracted
Citation Okuyama, MFukunaga, KUsui, KHayashi, NIijima, DHoriuchi, HItagaki, N Bicyclic or tricyclic heterocyclic compound US Patent US10065972 Publication Date 9/4/2018
 
Kynurenine/alpha-aminoadipate aminotransferase, mitochondrial
Name:Kynurenine/alpha-aminoadipate aminotransferase, mitochondrial
Type:Enzyme
Mol. Mass.:47353.09
Organism:Homo sapiens (Human)
Description:Q8N5Z0
Residue:425
BDBM273078
NameBDBM273078
Synonyms:(R)-N-(4-fluorobenzyl)-1-[6-methyl-5-(3-methyl-[1,2,4]oxadiazol-5-yl)-7-oxo-6,7-dihydro[1,3]thiazolo[5,4-d]pyrimidin-2-yl]pyrrolidine-2-carboxamide | US10065972, Example 213
TypeSmall organic molecule
Emp. Form.C21H20FN7O3S
Mol. Mass.469.492
SMILESCc1noc(n1)-c1nc2sc(nc2c(=O)n1C)N1CCC[C@@H]1C(=O)NCc1ccc(F)cc1