Reaction Details
TargetKynurenine/alpha-aminoadipate aminotransferase, mitochondrial
LigandBDBM273167
Substrate/Competitorn/a
Meas. Tech.KAT-II inhibitory assay
pH8±n/a
IC50 15.0±n/a nM
Commentsextracted
Citation Okuyama, MFukunaga, KUsui, KHayashi, NIijima, DHoriuchi, HItagaki, N Bicyclic or tricyclic heterocyclic compound US Patent US10065972 Publication Date 9/4/2018
 
Kynurenine/alpha-aminoadipate aminotransferase, mitochondrial
Name:Kynurenine/alpha-aminoadipate aminotransferase, mitochondrial
Type:Enzyme
Mol. Mass.:47353.09
Organism:Homo sapiens (Human)
Description:Q8N5Z0
Residue:425
BDBM273167
NameBDBM273167
Synonyms:(R)-N-benzyl-1-[7-chloro-6-(2-fluorophenyl)-4-oxo-4,5-dihydro[1,3]thiazolo[4,5-c]pyridin-2-yl]pyrrolidine-2-carboxamide | US10065972, Example 624
TypeSmall organic molecule
Emp. Form.C24H20ClFN4O2S
Mol. Mass.482.958
SMILESFc1ccccc1-c1[nH]c(=O)c2nc(sc2c1Cl)N1CCC[C@@H]1C(=O)NCc1ccccc1