Reaction Details
TargetNicotinic acetylcholine receptor
LigandBDBM50047021
Substrate/Competitorn/a
Ki 15.5±n/a nM
CommentsPDSP_1087
Citation Khan, IMYaksh, TLTaylor, P Ligand specificity of nicotinic acetylcholine receptors in rat spinal cord: studies with nicotine and cytisine. J Pharmacol Exp Ther270:159-66 (1994) Nicotinic acetylcholine receptor
Name:Nicotinic acetylcholine receptor
Type:Enzyme Catalytic Domain
Mol. Mass.:2478.99
Organism:RAT
Description:n-AChR 0 RAT::Q62594
Residue:23
BDBM50047021
NameBDBM50047021
Synonyms:2-(6-(2-hydroxy-2-phenylethyl)-1-methylpiperidin-2-yl)-1-phenylethanone 2-[6-(2-Hydroxy-2-phenyl-ethyl)-1-methyl-piperidin-2-yl]-1-phenyl-ethanone (lobeline) Lobeline Lobeline,Alpha
TypeSmall organic molecule
Emp. Form.C22H27NO2
Mol. Mass.337.4553
SMILESCN1C(CC(O)c2ccccc2)CCCC1CC(=O)c1ccccc1