Reaction Details
Target5-hydroxytryptamine receptor 2A
LigandBDBM50160807
Substrate/Competitorn/a
Ki 7680±n/a nM
CommentsPDSP_236
Citation Oka, MNoda, YOchi, YFurukawa, KUne, TKurumiya, SHino, KKarasawa, T Pharmacological profile of AD-5423, a novel antipsychotic with both potent dopamine-D2 and serotonin-S2 antagonist properties. J Pharmacol Exp Ther264:158-65 (1993) 5-hydroxytryptamine receptor 2A
Name:5-hydroxytryptamine receptor 2A
Type:G Protein-Coupled Receptor (GPCR)
Mol. Mass.:52852.05
Organism:Rattus norvegicus (rat)
Description:Rat cortex membranes 5-HT2A receptors.
Residue:471
BDBM50160807
NameBDBM50160807
Synonyms:4-(4-Fluoro-phenyl)-2-(4-propyl-piperazin-1-yl)-5,6,7,8,9,10-hexahydro-cycloocta[b]pyridine Blonanserin | CHEMBL178803
TypeSmall organic molecule
Emp. Form.C23H30FN3
Mol. Mass.367.5028
SMILESCCN1CCN(CC1)c1cc(-c2ccc(F)cc2)c2CCCCCCc2n1