Reaction Details
TargetD(2) dopamine receptor
LigandBDBM50160807
Substrate/Competitorn/a
Ki 14.8±n/a nM
CommentsPDSP_236
Citation Oka, MNoda, YOchi, YFurukawa, KUne, TKurumiya, SHino, KKarasawa, T Pharmacological profile of AD-5423, a novel antipsychotic with both potent dopamine-D2 and serotonin-S2 antagonist properties. J Pharmacol Exp Ther264:158-65 (1993) D(2) dopamine receptor
Name:D(2) dopamine receptor
Type:G Protein-Coupled Receptor (GPCR)
Mol. Mass.:50931.60
Organism:Rattus norvegicus (rat)
Description:P61169
Residue:444
BDBM50160807
NameBDBM50160807
Synonyms:4-(4-Fluoro-phenyl)-2-(4-propyl-piperazin-1-yl)-5,6,7,8,9,10-hexahydro-cycloocta[b]pyridine Blonanserin | CHEMBL178803
TypeSmall organic molecule
Emp. Form.C23H30FN3
Mol. Mass.367.5028
SMILESCCN1CCN(CC1)c1cc(-c2ccc(F)cc2)c2CCCCCCc2n1