Reaction Details
TargetBeta-lactamase
LigandBDBM43818
Substrate/Competitorn/a
Meas. Tech.Counterscreen for inhibitors of TLR9-MyD88 binding: fluorescence-based cell-based high throughput dose response assay to identify non-selective inhibitors of the beta-lactamase enzyme (BLA)
IC50 10706±n/a nM
Citation PubChem, PC Counterscreen for inhibitors of TLR9-MyD88 binding: fluorescence-based cell-based high throughput dose response assay to identify non-selective inhibitors of the beta-lactamase enzyme (BLA) PubChem Bioassay(2011)[AID]
 
Beta-lactamase
Name:Beta-lactamase
Synonyms:Beta lactamase
Type:Enzyme Catalytic Domain
Mol. Mass.:31513.38
Organism:Pseudomonas aeruginosa
Description:gi_114881106
Residue:286
BDBM43818
NameBDBM43818
TypeSmall organic molecule
Emp. Form.C33H29N2O2
Mol. Mass.485.595
SMILESCCN1\C(Oc2ccc(cc12)-c1ccccc1)=C\C=C\c1oc2ccc(cc2[n+]1CC)-c1ccccc1