Reaction Details
TargetOrotidine 5'-phosphate decarboxylase
LigandBDBM83820
Substrate/Competitorn/a
Meas. Tech.Luminescence-based cell-based high throughput dose response assay for activators of the GAA850 frataxin (FXN) promoter
EC50>2212±n/a nM
Citation PubChem, PC Luminescence-based cell-based high throughput dose response assay for activators of the GAA850 frataxin (FXN) promoter PubChem Bioassay(2011)[AID]
 
Orotidine 5'-phosphate decarboxylase
Name:Orotidine 5'-phosphate decarboxylase
Type:Enzyme Catalytic Domain
Mol. Mass.:30195.13
Organism:Aspergillus niger
Description:gi_2395
Residue:277
BDBM83820
NameBDBM83820
Synonyms:9-Amino-acridinium MLS001241050 acridin-10-ium-9-amine;chloride cid_24892261
TypeSmall organic molecule
Emp. Form.C13H11N2
Mol. Mass.195.2393
SMILESNc1c2ccccc2[nH+]c2ccccc12