Reaction Details
TargetOrotidine 5'-phosphate decarboxylase
LigandBDBM83830
Substrate/Competitorn/a
Meas. Tech.Luminescence-based cell-based high throughput dose response assay for activators of the GAA850 frataxin (FXN) promoter
EC50>59643±n/a nM
Citation PubChem, PC Luminescence-based cell-based high throughput dose response assay for activators of the GAA850 frataxin (FXN) promoter PubChem Bioassay(2011)[AID]
 
Orotidine 5'-phosphate decarboxylase
Name:Orotidine 5'-phosphate decarboxylase
Type:Enzyme Catalytic Domain
Mol. Mass.:30195.13
Organism:Aspergillus niger
Description:gi_2395
Residue:277
BDBM83830
NameBDBM83830
Synonyms:(1S,3R,3aS,6aR)-3-ethyl-1-[[ethyl-(4-methylphenyl)sulfonylamino]methyl]-4,6-dioxo-5-(phenylmethyl)-1,2,3a,6a-tetrahydropyrrolo[3,4-c]pyrrole-3-carboxylic acid methyl ester;2,2,2-trifluoroacetic acid MLS002477022 cid_44246821 methyl (1S,3R,3aS,6aR)-5-benzyl-3-ethyl-1-[[ethyl-(4-methylphenyl)sulfonylamino]methyl]-4,6-dioxo-1,2,3a,6a-tetrahydropyrrolo[3,4-c]pyrrole-3-carboxylate;2,2,2-trifluoroacetic acid
TypeSmall organic molecule
Emp. Form.C27H33N3O6S
Mol. Mass.527.632
SMILESCCN(C[C@H]1N[C@](CC)([C@@H]2[C@H]1C(=O)N(Cc1ccccc1)C2=O)C(=O)OC)S(=O)(=O)c1ccc(C)cc1