Reaction Details
TargetOrotidine 5'-phosphate decarboxylase
LigandBDBM83846
Substrate/Competitorn/a
Meas. Tech.Luminescence-based cell-based high throughput dose response assay for activators of the GAA850 frataxin (FXN) promoter
EC50>6624±n/a nM
Citation PubChem, PC Luminescence-based cell-based high throughput dose response assay for activators of the GAA850 frataxin (FXN) promoter PubChem Bioassay(2011)[AID]
 
Orotidine 5'-phosphate decarboxylase
Name:Orotidine 5'-phosphate decarboxylase
Type:Enzyme Catalytic Domain
Mol. Mass.:30195.13
Organism:Aspergillus niger
Description:gi_2395
Residue:277
BDBM83846
NameBDBM83846
Synonyms:5-(2-(dimethylamino)ethylamino)-8-hydroxy-6H-imidazo[4,5,1-de]acridin-6-one SMR001565157 | cid_371509
TypeSmall organic molecule
Emp. Form.C18H19ClN4O2
Mol. Mass.358.822
SMILESCl.CN(C)CCNc1ccc2ncn3c2c1c(=O)c1cc(O)ccc31