Reaction Details
TargetOrotidine 5'-phosphate decarboxylase
LigandBDBM83849
Substrate/Competitorn/a
Meas. Tech.Luminescence-based cell-based high throughput dose response assay for activators of the GAA850 frataxin (FXN) promoter
EC50>6629±n/a nM
Citation PubChem, PC Luminescence-based cell-based high throughput dose response assay for activators of the GAA850 frataxin (FXN) promoter PubChem Bioassay(2011)[AID]
 
Orotidine 5'-phosphate decarboxylase
Name:Orotidine 5'-phosphate decarboxylase
Type:Enzyme Catalytic Domain
Mol. Mass.:30195.13
Organism:Aspergillus niger
Description:gi_2395
Residue:277
BDBM83849
NameBDBM83849
Synonyms:MLS002702311 N-[2-(dimethylamino)ethyl]-6,9-dimethoxy-phenazine-1-carboxamide;hydrochloride SMR001565873 | cid_386517
TypeSmall organic molecule
Emp. Form.C19H22N4O3
Mol. Mass.354.403
SMILESCOc1ccc(OC)c2nc3c(cccc3nc12)C(=O)NCCN(C)C